{"text_format":"1","workbook":"xlsx","n_sheets":4,"sheets":["Adjustment Tab","Contract Consumption Tab (HIDE)","Weekly Rates Tab (HIDE)","Contract Base Rate Week (HIDE)"],"not_rendered":{"charts":0,"images":0,"macros":1,"external_links":0,"defined_names":2,"comments":0,"pivot_tables":0},"unopened":[],"bounds":{"document_bytes":16777216,"sheet_cells":100000,"rows_first":2000,"rows_last":500,"rows_between":2000,"halvings":0,"cell_chars":16384,"cell_head_chars":4096},"cells_cut":0,"cells_raw":0,"read":"whole","date_system":"1900"}

{"sheet":"Adjustment Tab","index":0,"n_rows":4,"n_cols":17,"rows_kept":4,"cut":false,"hidden":false,"merged":[[3,12,3,13]]}
["Contract #","Contract Activity","Usage Factor","Base Rate Date\n(Week Of)","Base Rate","*Current Rate Date\n(Activity Start Date)","*Current Rate","Total Adjustment Per Gallon\n(Base - Current)","Percentage Increase from Base","Gallons per unit (Consumption)","Adjustment Amount Per Unit of Accomplishment","Actual Accomplishment for this Invoice","Unit of Measure","Fuel Adjustment for this Invoice"]
[null,null,{"$f":"IF(B2=\"\",\"\",VLOOKUP(B2,'Contract Consumption Tab (HIDE)'!A:G,7,FALSE))","v":""},{"$f":"IF(A2=\"\",\"\",(VLOOKUP(A2,'Contract Base Rate Week (HIDE)'!A:B,2,FALSE)))","v":""},{"$f":"IF(D2=\"\",\"\",(VLOOKUP(D2,'Weekly Rates Tab (HIDE)'!A:C,2,FALSE)))","v":""},null,{"$f":"IF(F2=\"\",\"\",(VLOOKUP(F2,'Weekly Rates Tab (HIDE)'!A:B,2,FALSE)))","v":""},{"$f":"IF(G2=\"\",\"\",G2-E2)","v":""},{"$f":"IF(G2=\"\",\"\",(G2-E2)/E2)","v":""},{"$f":"IF(B2=\"\",\"\",(VLOOKUP(B2,'Contract Consumption Tab (HIDE)'!A:G,7,FALSE)))","v":""},{"$f":"IF(I2<=0.1,\"No Adjustment\",(IF(H2=\"\",\"\",H2*J2)))","v":""},null,{"$f":"IF(B2=\"\",\"\",VLOOKUP(B2,'Contract Consumption Tab (HIDE)'!A:G,2,FALSE))","v":""},{"$f":"IF(K2=\"No Adjustment\",\"No Adjustment\",(IF(L2=\"\",\"\",K2*L2)))","v":""},null,{"$f":"NOW()","v":"2024-09-04T08:16:43.640"},{"$f":"IF(F2=\"\",\"\",\"\\\\nts\\hq\\maintstateshare\\Fuel_Adjustment\\Saved_Adjustment_Calculations\\\"&TEXT(A2,0)&\" - \"&TEXT(F2,\"yymmdd\")&\".PDF\")","v":""}]
[null,null,null,null,{"$f":"IF(D3=\"\",\"\",(VLOOKUP(D3,'Weekly Rates Tab (HIDE)'!A:B,2,FALSE)))","v":""},null,{"$f":"IF(F3=\"\",\"\",(VLOOKUP(F3,'Weekly Rates Tab (HIDE)'!A:B,2,FALSE)))","v":""},{"$f":"IF(G3=\"\",\"\",G3-E3)","v":""},null,{"$f":"IF(B3=\"\",\"\",(VLOOKUP(B3,'Contract Consumption Tab (HIDE)'!A:G,7,FALSE)))","v":""},{"$f":"IF(H3=\"\",\"\",H3*J3)","v":""},null,{"$f":"IF(B3=\"\",\"\",VLOOKUP(B3,'Contract Consumption Tab (HIDE)'!A:G,2,FALSE))","v":""},{"$f":"IF(L3=\"\",\"\",K3*L3)","v":""},null,null,{"$f":"TEXT(A2,0) & \" - \"& \"Rate Date \"& TEXT(F2,\"mmddyy\")","v":"0 - Rate Date 010000"}]
[null,null,null,null,null,null,null,null,null,null,null,"Date Generated:",{"$f":"TODAY()","v":"2024-09-04"}]

{"sheet":"Contract Consumption Tab (HIDE)","index":1,"n_rows":5,"n_cols":8,"rows_kept":5,"cut":false,"hidden":true,"merged":[]}
["Contract Activity","UOM","Fuel Type","Standard Equipment Compliments","Average Consumption/Operating Hour (Gallons)","Accomplishment/Operating Hour","Usage Factor (Gallons per unit of accomplisment - rounded down to nearest 0.05)","Notes"]
["Mowing (Acres)","Acres","Diesel","Average 80 PTO-HP Tractor",5,"4.24 acres / hour",1.1499999999999999]
["Brush Management (Acres)","Acres","Diesel","*Skid or Tractor (90-100HP) w Boom",5,"Contract minimum of 8 acres/day (1 Acre/Hour)",5]
["Veg. Grinding - Boom (Hourly)","Hourly","Diesel","Excavator (Boom) with Grinding Head auxillary engine",16,"N/A - Hourly Contract",16]
["Veg. Grinding - Deck (Hourly)","Hourly","Diesel","*Skid ",4,"N/A - Hourly Contract",4]

{"sheet":"Weekly Rates Tab (HIDE)","index":2,"n_rows":366,"n_cols":3,"rows_kept":366,"cut":false,"hidden":false,"merged":[]}
["Week Of","PADD 1C (Retail Diesel)","https://www.eia.gov/dnav/pet/pet_pri_gnd_dcus_r1z_w.htm"]
["2019-01-07",2.9209999999999998]
["2019-01-14",2.903]
["2019-01-21",2.8839999999999999]
["2019-01-28",2.8929999999999998]
["2019-02-04",2.879]
["2019-02-11",2.8719999999999999]
["2019-02-18",2.927]
["2019-02-25",2.9489999999999998]
["2019-03-04",2.9849999999999999]
["2019-03-11",2.9809999999999999]
["2019-03-18",2.9809999999999999]
["2019-03-25",2.9950000000000001]
["2019-04-01",2.9910000000000001]
["2019-04-08",2.9980000000000002]
["2019-04-15",3.0150000000000001]
["2019-04-22",3.0329999999999999]
["2019-04-29",3.0569999999999999]
["2019-05-06",3.0510000000000002]
["2019-05-13",3.0350000000000001]
["2019-05-20",3.03]
["2019-05-27",3.02]
["2019-06-03",3.0110000000000001]
["2019-06-10",2.9889999999999999]
["2019-06-17",2.964]
["2019-06-24",2.9460000000000002]
["2019-07-01",2.9409999999999998]
["2019-07-08",2.94]
["2019-07-15",2.9409999999999998]
["2019-07-22",2.9369999999999998]
["2019-07-29",2.9239999999999999]
["2019-08-05",2.923]
["2019-08-12",2.9039999999999999]
["2019-08-19",2.8919999999999999]
["2019-08-26",2.8740000000000001]
["2019-09-02",2.8740000000000001]
["2019-09-09",2.871]
["2019-09-16",2.8740000000000001]
["2019-09-23",2.9710000000000001]
["2019-09-30",2.948]
["2019-10-07",2.915]
["2019-10-14",2.92]
["2019-10-21",2.9159999999999999]
["2019-10-28",2.9319999999999999]
["2019-11-04",2.9049999999999998]
["2019-11-11",2.919]
["2019-11-18",2.9220000000000002]
["2019-11-25",2.9209999999999998]
["2019-12-02",2.9279999999999999]
["2019-12-09",2.9140000000000001]
["2019-12-16",2.9209999999999998]
["2019-12-23",2.9129999999999998]
["2019-12-30",2.9750000000000001]
["2020-01-06",3]
["2020-01-13",2.984]
["2020-01-20",2.948]
["2020-01-27",2.9140000000000001]
["2020-02-03",2.863]
["2020-02-10",2.8159999999999998]
["2020-02-17",2.7930000000000001]
["2020-02-24",2.7789999999999999]
["2020-03-02",2.7480000000000002]
["2020-03-09",2.7090000000000001]
["2020-03-16",2.6269999999999998]
["2020-03-23",2.573]
["2020-03-30",2.5139999999999998]
["2020-04-06",2.48]
["2020-04-13",2.4500000000000002]
["2020-04-20",2.4340000000000002]
["2020-04-27",2.4060000000000001]
["2020-05-04",2.36]
["2020-05-11",2.3479999999999999]
["2020-05-18",2.3450000000000002]
["2020-05-25",2.359]
["2020-06-01",2.3490000000000002]
["2020-06-08",2.359]
["2020-06-15",2.359]
["2020-06-22",2.37]
["2020-06-29",2.3769999999999998]
["2020-07-06",2.3879999999999999]
["2020-07-13",2.387]
["2020-07-20",2.3769999999999998]
["2020-07-27",2.375]
["2020-08-03",2.3719999999999999]
["2020-08-10",2.37]
["2020-08-17",2.3650000000000002]
["2020-08-24",2.363]
["2020-08-31",2.379]
["2020-09-07",2.37]
["2020-09-14",2.3570000000000002]
["2020-09-21",2.343]
["2020-09-28",2.323]
["2020-10-05",2.3279999999999998]
["2020-10-12",2.3319999999999999]
["2020-10-19",2.3159999999999998]
["2020-10-26",2.3109999999999999]
["2020-11-02",2.2839999999999998]
["2020-11-09",2.2959999999999998]
["2020-11-16",2.3370000000000002]
["2020-11-23",2.3650000000000002]
["2020-11-30",2.4]
["2020-12-07",2.4329999999999998]
["2020-12-14",2.4710000000000001]
["2020-12-21",2.5329999999999999]
["2020-12-28",2.5339999999999998]
["2021-01-04",2.54]
["2021-01-11",2.6080000000000001]
["2021-01-18",2.6269999999999998]
["2021-01-25",2.6419999999999999]
["2021-02-01",2.6749999999999998]
["2021-02-08",2.74]
["2021-02-15",2.798]
["2021-02-22",2.9209999999999998]
["2021-03-01",3.0179999999999998]
["2021-03-08",3.0270000000000001]
["2021-03-15",3.0640000000000001]
["2021-03-22",3.0640000000000001]
["2021-03-29",3.0409999999999999]
["2021-04-05",3.0179999999999998]
["2021-04-12",3.0009999999999999]
["2021-04-19",2.9929999999999999]
["2021-04-26",2.98]
["2021-05-03",3.004]
["2021-05-10",3.0510000000000002]
["2021-05-17",3.13]
["2021-05-24",3.137]
["2021-05-31",3.1349999999999998]
["2021-06-07",3.1629999999999998]
["2021-06-14",3.181]
["2021-06-21",3.1749999999999998]
["2021-06-28",3.1909999999999998]
["2021-07-05",3.2040000000000002]
["2021-07-12",3.2130000000000001]
["2021-07-19",3.2109999999999999]
["2021-07-26",3.2130000000000001]
["2021-08-02",3.238]
["2021-08-09",3.23]
["2021-08-16",3.2120000000000002]
["2021-08-23",3.1859999999999999]
["2021-08-30",3.2010000000000001]
["2021-09-06",3.24]
["2021-09-13",3.246]
["2021-09-20",3.266]
["2021-09-27",3.2879999999999998]
["2021-10-04",3.3620000000000001]
["2021-10-11",3.484]
["2021-10-18",3.5819999999999999]
["2021-10-25",3.621]
["2021-11-01",3.6309999999999998]
["2021-11-08",3.6240000000000001]
["2021-11-15",3.62]
["2021-11-22",3.5950000000000002]
["2021-11-29",3.5859999999999999]
["2021-12-06",3.556]
["2021-12-13",3.5209999999999999]
["2021-12-20",3.496]
["2021-12-27",3.488]
["2022-01-03",3.49]
["2022-01-10",3.5470000000000002]
["2022-01-17",3.6240000000000001]
["2022-01-24",3.6859999999999999]
["2022-01-31",3.7610000000000001]
["2022-02-07",3.8959999999999999]
["2022-02-14",3.98]
["2022-02-21",4.0140000000000002]
["2022-02-28",4.069]
["2022-03-07",4.9189999999999996]
["2022-03-14",5.2640000000000002]
["2022-03-21",5.1100000000000003]
["2022-03-28",5.1449999999999996]
["2022-04-04",5.0949999999999998]
["2022-04-11",5.0179999999999998]
["2022-04-18",5.0330000000000004]
["2022-04-25",5.0860000000000003]
["2022-05-02",5.4009999999999998]
["2022-05-09",5.58]
["2022-05-16",5.6050000000000004]
["2022-05-23",5.5679999999999996]
["2022-05-30",5.5519999999999996]
["2022-06-06",5.7069999999999999]
["2022-06-13",5.7359999999999998]
["2022-06-20",5.7619999999999996]
["2022-06-27",5.6989999999999998]
["2022-07-04",5.5970000000000004]
["2022-07-11",5.4790000000000001]
["2022-07-18",5.34]
["2022-07-25",5.1539999999999999]
["2022-08-01",5.0270000000000001]
["2022-08-08",4.8739999999999997]
["2022-08-15",4.8019999999999996]
["2022-08-22",4.7949999999999999]
["2022-08-29",4.992]
["2022-09-05",4.95]
["2022-09-12",4.8650000000000002]
["2022-09-19",4.8]
["2022-09-26",4.7519999999999998]
["2022-10-03",4.7160000000000002]
["2022-10-10",5.056]
["2022-10-17",5.19]
["2022-10-24",5.1820000000000004]
["2022-10-31",5.1829999999999998]
["2022-11-07",5.242]
["2022-11-14",5.242]
["2022-11-21",5.1779999999999999]
["2022-11-28",5.0880000000000001]
["2022-12-05",4.9530000000000003]
["2022-12-12",4.7789999999999999]
["2022-12-19",4.6369999999999996]
["2022-12-26",4.6040000000000001]
["2023-01-02",4.6890000000000001]
["2023-01-09",4.641]
["2023-01-16",4.6139999999999999]
["2023-01-23",4.6859999999999999]
["2023-01-30",4.7229999999999999]
["2023-02-06",4.6239999999999997]
["2023-02-13",4.5030000000000001]
["2023-02-20",4.4210000000000003]
["2023-02-27",4.2859999999999996]
["2023-03-06",4.2539999999999996]
["2023-03-13",4.1959999999999997]
["2023-03-20",4.1479999999999997]
["2023-03-27",4.0869999999999997]
["2023-04-03",4.0780000000000003]
["2023-04-10",4.0549999999999997]
["2023-04-17",4.056]
["2023-04-24",4.0039999999999996]
["2023-05-01",3.931]
["2023-05-08",3.8340000000000001]
["2023-05-15",3.7869999999999999]
["2023-05-22",3.78]
["2023-05-29",3.7469999999999999]
["2023-06-05",3.702]
["2023-06-12",3.7320000000000002]
["2023-06-19",3.7450000000000001]
["2023-06-26",3.7349999999999999]
["2023-07-03",3.6859999999999999]
["2023-07-10",3.754]
["2023-07-17",3.7789999999999999]
["2023-07-24",3.8929999999999998]
["2023-07-31",4.101]
["2023-08-07",4.1959999999999997]
["2023-08-14",4.3710000000000004]
["2023-08-21",4.3739999999999997]
["2023-08-28",4.4290000000000003]
["2023-09-04",4.4189999999999996]
["2023-09-11",4.4169999999999998]
["2023-09-18",4.4560000000000004]
["2023-09-25",4.4290000000000003]
["2023-10-02",4.4550000000000001]
["2023-10-09",4.3490000000000002]
["2023-10-16",4.29]
["2023-10-23",4.2990000000000004]
["2023-10-30",4.2169999999999996]
["2023-11-06",4.1630000000000003]
["2023-11-13",4.0789999999999997]
["2023-11-20",4.0069999999999997]
["2023-11-27",3.9590000000000001]
["2023-12-04",3.99]
["2023-12-11",3.88]
["2023-12-18",3.7930000000000001]
["2023-12-25",3.879]
["2024-01-01",3.8580000000000001]
["2024-01-08",3.8140000000000001]
["2024-01-15",3.8650000000000002]
["2024-01-22",3.8530000000000002]
["2024-01-29",3.9489999999999998]
["2024-02-05",3.9289999999999998]
["2024-02-12",4.1429999999999998]
["2024-02-19",4.1890000000000001]
["2024-02-26",4.12]
["2024-03-04",4.077]
["2024-03-11",4.0330000000000004]
["2024-03-18",4.0460000000000003]
["2024-03-25",4.0419999999999998]
["2024-04-01",3.99]
["2024-04-08",4.0419999999999998]
["2024-04-15",3.9790000000000001]
["2024-04-22",3.9409999999999998]
["2024-04-29",3.919]
["2024-05-06",3.8460000000000001]
["2024-05-13",3.794]
["2024-05-20",3.7850000000000001]
["2024-05-27",3.77]
["2024-06-03",3.7410000000000001]
["2024-06-10",3.67]
["2024-06-17",3.7269999999999999]
["2024-06-24",3.79]
["2024-07-01",3.8119999999999998]
["2024-07-08",3.8610000000000002]
["2024-07-15",3.8290000000000002]
["2024-07-22",3.778]
["2024-07-29",3.7509999999999999]
["2024-08-05",3.742]
["2024-08-12",3.681]
["2024-08-19",3.6640000000000001]
["2024-08-26",3.6280000000000001]
["2024-09-02",3.58]
["2024-09-09"]
["2024-09-16"]
["2024-09-23"]
["2024-09-30"]
["2024-10-07"]
["2024-10-14"]
["2024-10-21"]
["2024-10-28"]
["2024-11-04"]
["2024-11-11"]
["2024-11-18"]
["2024-11-25"]
["2024-12-02"]
["2024-12-09"]
["2024-12-16"]
["2024-12-23"]
["2024-12-30"]
["2025-01-06"]
["2025-01-13"]
["2025-01-20"]
["2025-01-27"]
["2025-02-03"]
["2025-02-10"]
["2025-02-17"]
["2025-02-24"]
["2025-03-03"]
["2025-03-10"]
["2025-03-17"]
["2025-03-24"]
["2025-03-31"]
["2025-04-07"]
["2025-04-14"]
["2025-04-21"]
["2025-04-28"]
["2025-05-05"]
["2025-05-12"]
["2025-05-19"]
["2025-05-26"]
["2025-06-02"]
["2025-06-09"]
["2025-06-16"]
["2025-06-23"]
["2025-06-30"]
["2025-07-07"]
["2025-07-14"]
["2025-07-21"]
["2025-07-28"]
["2025-08-04"]
["2025-08-11"]
["2025-08-18"]
["2025-08-25"]
["2025-09-01"]
["2025-09-08"]
["2025-09-15"]
["2025-09-22"]
["2025-09-29"]
["2025-10-06"]
["2025-10-13"]
["2025-10-20"]
["2025-10-27"]
["2025-11-03"]
["2025-11-10"]
["2025-11-17"]
["2025-11-24"]
["2025-12-01"]
["2025-12-08"]
["2025-12-15"]
["2025-12-22"]
["2025-12-29"]

{"sheet":"Contract Base Rate Week (HIDE)","index":3,"n_rows":116,"n_cols":4,"rows_kept":116,"cut":false,"hidden":false,"merged":[]}
["Contract Number","Fuel Base Rate Week of","Last Updated Date by Procurement","Notes"]
[4400012345,"2022-01-03","2022-04-04","SAMPLE FOR USE"]
[4400021595,"2022-01-03","2022-04-04","Newberry Trad Mow - Schultz Farms"]
[4400025726,"2022-01-03","2022-04-04","Charleston Trad Mow - Cooper Landscape Maintenance"]
[4400026733,"2022-01-03","2022-04-04","Oconee Trad Mow - Dixie Lawn Service"]
[4400026704,"2022-01-03","2022-04-04","Aiken Trad Mow - Dixie Lawn Service"]
[4400026659,"2022-01-03","2022-04-04","Fairfield Trad Mow - Schultz Farms"]
[4400028377,"2022-01-03","2022-04-04","York Trad Mow - Dixie Lawn Service"]
[4400028383,"2022-01-03","2022-04-04","Richland Trad Mow - Circle G Landscaping"]
[4400028386,"2022-01-03","2022-04-04","Beaufort Trad Mow - Dixie Lawn Service"]
[4400028349,"2022-01-03","2022-04-04","Union Trad Mow - Atoah Contracting"]
[4400028376,"2022-01-03","2022-04-04","Colleton Trad Mow - Schultz Farms"]
[4400028380,"2022-01-03","2022-04-04","Cherokee Trad Mow - South East Mowing"]
[4400028381,"2022-01-03","2022-04-04","Lexington Trad Mow - Schultz Farms"]
[4400028396,"2022-01-03","2022-04-04","Spartanburg Trad Mow - Maddox Contractors"]
[4400028384,"2022-01-03","2022-04-04","Pickens Trad Mow - Maddox Contractors"]
[4400028388,"2022-01-03","2022-04-04","Marlboro Trad Mow - Langston Enterprises"]
[4400028382,"2022-01-03","2022-04-04","Anderson Trad Mow - Burchfield Contracting"]
[4400028389,"2022-01-03","2022-04-04","Dillon Trad Mow - Pee Dee Mowing"]
[4400028392,"2022-01-03","2022-04-04","Horry Trad Mow - Dixie Lawn Service"]
[4400028391,"2022-01-03","2022-04-04","Berkeley Trad Mow - Dixie lawn Service"]
[4400028387,"2022-01-03","2022-04-04","Hampton/Jasper Trad Mow - G & G Enterprises of the Lowcountry"]
[4400028393,"2022-01-03","2022-04-04","Laurens Trad Mow - Maddox Contractors"]
[4400028790,"2022-01-03","2022-04-04","Sumter Trad Mow  - Evans Mowing"]
[44000,"2022-01-03","2022-04-04","Greenville Trad Mow"]
[4400028867,"2022-01-03","2022-04-04","Lancaster Trad Mow -Dixie Lawn Service"]
[4400021666,"2022-01-03","2022-04-04","FP Mowing: Burchfield"]
[4400023321,"2022-01-03","2022-04-04","FP Mowing: EC Green"]
[4400023498,"2022-01-03","2022-04-04","FP Mowing: Langston"]
[4400023511,"2022-01-03","2022-04-04","FP Mowing: All-In-C-U Mowing"]
[4400023893,"2022-01-03","2022-04-04","FP Mowing: Sheehan"]
[4400023904,"2022-01-03","2022-04-04","FP Mowing: Gamecock"]
[4400024354,"2022-01-03","2022-04-04","FP Mowing: Pee Dee"]
[4400024355,"2022-01-03","2022-04-04","FP Mowing: HBS Brush Management"]
[4400025463,"2022-01-03","2022-04-04","FP Mowing RSB Holdings"]
[4400025466,"2022-01-03","2022-04-04","FP Mowing: Southern Brush Management"]
[4400026872,"2022-01-03","2022-04-04","FP Mowing: NGL and Erosion Control Group LLC"]
[4400028330,"2022-01-03","2022-04-04","FP Mowing:G & G Enterprises of the Lowcountry"]
[4400020694,"2022-01-03","2022-04-04","FP Mowing: Dixie Lawn Service"]
[4400020695,"2022-01-03","2022-04-04","FP Mowing: Enviro AgScience"]
[4400020696,"2022-01-03","2022-04-04","FP Mowing : Loving Contracting"]
[4400020698,"2022-01-03","2022-04-04","FP Mowing: LA LawnCare"]
[4400020699,"2022-01-03","2022-04-04","FP Mowing: Owen Contracting"]
[4400020713,"2022-01-03","2022-04-04","FP Mowing: J&R Towing"]
[4400020714,"2022-01-03","2022-04-04","FP Mowing: A & E Land Maintenance"]
[4400020715,"2022-01-03","2022-04-04","FP Mowing: Yellowstone"]
[4400020716,"2022-01-03","2022-04-04","FP Mowing: Four Shores Property"]
[4400020717,"2022-01-03","2022-04-04","FP Mowing: Rodgers Mowing Service"]
[4400020718,"2022-01-03","2022-04-04","FP Mowing: Cooper Landscape Maintenance"]
[4400020720,"2022-01-03","2022-04-04","FP Mowing: ProCutters"]
[4400020721,"2022-01-03","2022-04-04","FP Mowing: McKenzie Brush Management"]
[4400020730,"2022-01-03","2022-04-04","FP Mowing: Orr Contracting"]
[4400020731,"2022-01-03","2022-04-04","FP Mowing: Schultz Contracting"]
[4400020732,"2022-01-03","2022-04-04","FP Mowing: Circle G Landscaping"]
[4400020733,"2022-01-03","2022-04-04","FP Mowing: South East Mowing"]
[4400026624,"2022-01-03","2022-04-04","MBM: Sheehan"]
[4400026625,"2022-01-03","2022-04-04","MBM: Southern Brush Management"]
[4400026626,"2022-01-03","2022-04-04","MBM: Landscape Accents"]
[4400026627,"2022-01-03","2022-04-04","MBM: McCrae"]
[4400026628,"2022-01-03","2022-04-04","MBM: Burton Farm"]
[4400026629,"2022-01-03","2022-04-04","MBM: R Bettis"]
[4400026630,"2022-01-03","2022-04-04","MBM: East Coast Green"]
[4400026631,"2022-01-03","2022-04-04","MBM: RWR Forestry"]
[4400026634,"2022-01-03","2022-04-04","MBM: NaturChem"]
[4400026632,"2022-01-03","2022-04-04","MBM: Stilhwater"]
[4400026635,"2022-01-03","2022-04-04","MBM: State Tree Service"]
[4400024734,"2022-01-03","2022-04-04","Veg Grind: L-J Inc"]
[4400024735,"2022-01-03","2022-04-04","Veg Grind: Palmetto Property & Wildlife"]
[4400024737,"2022-01-03","2022-04-04","Veg Grind: Mitchums Construction"]
[4400024738,"2022-01-03","2022-04-04","Veg Grind: Sheehan"]
[4400024739,"2022-01-03","2022-04-04","Veg Grind: NaturChem"]
[4400024740,"2022-01-03","2022-04-04","Veg Grind: LI Johnson"]
[4400024741,"2022-01-03","2022-04-04","Veg Grind: West Land Clearing"]
[4400024742,"2022-01-03","2022-04-04","Veg Grind: Tom Brigman Contractors"]
[4400024743,"2022-01-03","2022-04-04","Veg Grind: South East Mowing"]
[4400024744,"2022-01-03","2022-04-04","Veg Grind: McClam & Associates"]
[4400024745,"2022-01-03","2022-04-04","Veg Grind: NGE Services"]
[4400024747,"2022-01-03","2022-04-04","Veg Grind: Pride Contracting"]
[4400024748,"2022-01-03","2022-04-04","Veg Grind: Circle G"]
[4400024749,"2022-01-03","2022-04-04","Veg Grind: Whaken & Stackem"]
[4400024750,"2022-01-03","2022-04-04","Veg Grind: Burchfield Contracting"]
[4400024751,"2022-01-03","2022-04-04","Veg Grind: Carolina Brush Cutting"]
[4400024752,"2022-01-03","2022-04-04","Veg Grind: Stroble Site Services"]
[4400024753,"2022-01-03","2022-04-04","Veg Grind: Dominick Clearing"]
[4400024754,"2022-01-03","2022-04-04","Veg Grind: East Coast Green"]
[4400024755,"2022-01-03","2022-04-04","Veg Grid: TAZZ LLC"]
[4400024756,"2022-01-03","2022-04-04","Veg Grind: Allscapes Outdoor"]
[4400024757,"2022-01-03","2022-04-04","Veg Grind: Gamecock Mowing"]
[4400024758,"2022-01-03","2022-04-04","Veg Grind: Hess Construction"]
[4400024759,"2022-01-03","2022-04-04","Veg Grind: Burton Farm"]
[4400026975,"2022-01-03","2022-04-04","Veg Grind: RWR Forestry"]
[4400027048,"2022-01-03","2022-04-04","Veg Grind: Meadow Wood"]
[4400027049,"2022-01-03","2022-04-04","Veg Grind: LA Lawncare"]
[4400020814,"2022-01-03","2022-04-27","Darlington Traditional Mowing: Langston Enterprises"]
[4400020813,"2022-01-03","2022-04-27","Marion Traditional Mowing: Langston Enterprises"]
[4400020777,"2022-01-03","2022-04-27","Florence Traditional Mowing: Langston Enterprises"]
[4400022577,"2022-01-03","2022-04-27","Chester Traditional Mowing: Dixie Lawn Service"]
[4400020883,"2022-01-03","2022-04-27","Williamsburg Traditional Mowing : Rodgers"]
[4400023893,"2022-01-03","2022-04-27","Sheehan Fixed Price Mowing"]
[4400022962,"2022-01-03","2022-05-05","Georgetown Traditional Mowing: Four Shores Propoerty"]
[4400028837,"2022-01-03","2022-05-05","MBM: Langston Enterprises"]
[4400028838,"2022-01-03","2022-05-05","MBM: South East Mowing"]
[4400029512,"2022-01-03","2022-05-31","Chesterfield Mowing: Owen Contracting"]
["4400024355D","2022-03-07","2022-07-12","Langston FP Dorchester Only"]
[4400030974,"2023-01-02","2023-03-02","Tremow Farm & Land LLC"]
[4400030978,"2023-01-02","2023-03-02","Atoah Contracting LLC"]
[4400030903,"2023-01-23","2023-03-02","Schultz Farms LLC MBM"]
[4400031126,"2023-02-06","2023-05-02","Atoah Contracting LLC/Kershaw Mowing"]
[4400028383,"2023-02-06","2023-05-02","Circle G/Richland Mowing"]
[4400031349,"2023-02-06","2023-05-02","Dixie Lawn/Dorchester Mowing"]
[4400031127,"2023-02-06","2023-05-02","Orr Contracting/Laurens Mowing"]
[4400031129,"2023-02-06","2023-05-02","Atoah Contracting/Clarendon Mowing"]
[4400031349,"2023-02-06","2023-06-16","Dixie Lawn/Dorchester Mowing"]
[4400031900,"2023-02-06","2023-06-16","Ace Clearing and Construction/Richland Mowing"]
[4400032642,"2023-08-07","2023-08-11","Opterra Solutions Inc/Agencywide Mechinical Brush Management"]
[4400032609,"2023-08-07","2023-08-11","Opterra Solutions Inc/Agencywide Vegetation Grinding"]